Failed

projectroot.sdk_test.ChainsTest.ExecMode_Operator (from CTest)

Failing for the past 3,552 builds (Since #1 )
Took 24 ms.

Stacktrace

Note: Google Test filter = ChainsTest.ExecMode_Operator
[==========] Running 1 test from 1 test suite.
[----------] Global test environment set-up.
[----------] 1 test from ChainsTest
[ RUN      ] ChainsTest.ExecMode_Operator
../sdk_test/chains_test.cpp:31: Failure
Expected equality of these values:
  chain_exec_mode_t::none
    Which is: 1-byte object <00>
  t++
    Which is: 1-byte object <05>
[  FAILED  ] ChainsTest.ExecMode_Operator (0 ms)
[----------] 1 test from ChainsTest (0 ms total)

[----------] Global test environment tear-down
[==========] 1 test from 1 test suite ran. (0 ms total)
[  PASSED  ] 0 tests.
[  FAILED  ] 1 test, listed below:
[  FAILED  ] ChainsTest.ExecMode_Operator

 1 FAILED TEST

Standard Output

Note: Google Test filter = ChainsTest.ExecMode_Operator
[==========] Running 1 test from 1 test suite.
[----------] Global test environment set-up.
[----------] 1 test from ChainsTest
[ RUN      ] ChainsTest.ExecMode_Operator
../sdk_test/chains_test.cpp:31: Failure
Expected equality of these values:
  chain_exec_mode_t::none
    Which is: 1-byte object <00>
  t++
    Which is: 1-byte object <05>
[  FAILED  ] ChainsTest.ExecMode_Operator (0 ms)
[----------] 1 test from ChainsTest (0 ms total)

[----------] Global test environment tear-down
[==========] 1 test from 1 test suite ran. (0 ms total)
[  PASSED  ] 0 tests.
[  FAILED  ] 1 test, listed below:
[  FAILED  ] ChainsTest.ExecMode_Operator

 1 FAILED TEST