Failed

projectroot.networkf.NetworkFTest.Smoke (from CTest)

Failing for the past 52 builds (Since #3549 )
Took 23 ms.

Stacktrace

Note: Google Test filter = NetworkFTest.Smoke
[==========] Running 1 test from 1 test suite.
[----------] Global test environment set-up.
[----------] 1 test from NetworkFTest
[ RUN      ] NetworkFTest.Smoke
..\networkf\networkf_test.cpp(35): error: Failed
Implemente me!
[  FAILED  ] NetworkFTest.Smoke (7 ms)
[----------] 1 test from NetworkFTest (7 ms total)

[----------] Global test environment tear-down
[==========] 1 test from 1 test suite ran. (8 ms total)
[  PASSED  ] 0 tests.
[  FAILED  ] 1 test, listed below:
[  FAILED  ] NetworkFTest.Smoke

 1 FAILED TEST

Standard Output

Note: Google Test filter = NetworkFTest.Smoke
[==========] Running 1 test from 1 test suite.
[----------] Global test environment set-up.
[----------] 1 test from NetworkFTest
[ RUN      ] NetworkFTest.Smoke
..\networkf\networkf_test.cpp(35): error: Failed
Implemente me!
[  FAILED  ] NetworkFTest.Smoke (7 ms)
[----------] 1 test from NetworkFTest (7 ms total)

[----------] Global test environment tear-down
[==========] 1 test from 1 test suite ran. (8 ms total)
[  PASSED  ] 0 tests.
[  FAILED  ] 1 test, listed below:
[  FAILED  ] NetworkFTest.Smoke

 1 FAILED TEST