Failed

projectroot.sdk.DizTest.BlockChars (from CTest)

Failing for the past 53 builds (Since #3548 )
Took 23 ms.

Stacktrace

Note: Google Test filter = DizTest.BlockChars
[==========] Running 1 test from 1 test suite.
[----------] Global test environment set-up.
[----------] 1 test from DizTest
[ RUN      ] DizTest.BlockChars
../sdk/files/diz_test.cpp:86: Failure
Expected equality of these values:
  d.description()
    Which is: "\xEF  \xEF  \xEF  \xEF  \xEF  \xEF  \xEF  \xEF  \xEF  \xEF  \xEF  \xEF  [ CyberWall v2.0\xEF  L ]\xEF  \xEF  \xEF  \xEF  \xEF  \xEF  \xEF  \xEF  \xEF  \xEF"
  "[ CyberWall v2.0�L ]"
    Which is: "[ CyberWall v2.0\xEF\xBF\xBDL ]"
    As Text: "[ CyberWall v2.0�L ]"
[  FAILED  ] DizTest.BlockChars (0 ms)
[----------] 1 test from DizTest (0 ms total)

[----------] Global test environment tear-down
[==========] 1 test from 1 test suite ran. (0 ms total)
[  PASSED  ] 0 tests.
[  FAILED  ] 1 test, listed below:
[  FAILED  ] DizTest.BlockChars

 1 FAILED TEST

Standard Output

Note: Google Test filter = DizTest.BlockChars
[==========] Running 1 test from 1 test suite.
[----------] Global test environment set-up.
[----------] 1 test from DizTest
[ RUN      ] DizTest.BlockChars
../sdk/files/diz_test.cpp:86: Failure
Expected equality of these values:
  d.description()
    Which is: "\xEF  \xEF  \xEF  \xEF  \xEF  \xEF  \xEF  \xEF  \xEF  \xEF  \xEF  \xEF  [ CyberWall v2.0\xEF  L ]\xEF  \xEF  \xEF  \xEF  \xEF  \xEF  \xEF  \xEF  \xEF  \xEF"
  "[ CyberWall v2.0�L ]"
    Which is: "[ CyberWall v2.0\xEF\xBF\xBDL ]"
    As Text: "[ CyberWall v2.0�L ]"
[  FAILED  ] DizTest.BlockChars (0 ms)
[----------] 1 test from DizTest (0 ms total)

[----------] Global test environment tear-down
[==========] 1 test from 1 test suite ran. (0 ms total)
[  PASSED  ] 0 tests.
[  FAILED  ] 1 test, listed below:
[  FAILED  ] DizTest.BlockChars

 1 FAILED TEST