Failed

projectroot.networkf.NetworkFTest.Smoke (from CTest)

Failing for the past 1 build (Since #3549 )
Took 4 ms.

Stacktrace

Note: Google Test filter = NetworkFTest.Smoke
[==========] Running 1 test from 1 test suite.
[----------] Global test environment set-up.
[----------] 1 test from NetworkFTest
[ RUN      ] NetworkFTest.Smoke
../networkf/networkf_test.cpp:35: Failure
Failed
Implemente me!
[  FAILED  ] NetworkFTest.Smoke (0 ms)
[----------] 1 test from NetworkFTest (0 ms total)

[----------] Global test environment tear-down
[==========] 1 test from 1 test suite ran. (0 ms total)
[  PASSED  ] 0 tests.
[  FAILED  ] 1 test, listed below:
[  FAILED  ] NetworkFTest.Smoke

 1 FAILED TEST

Standard Output

Note: Google Test filter = NetworkFTest.Smoke
[==========] Running 1 test from 1 test suite.
[----------] Global test environment set-up.
[----------] 1 test from NetworkFTest
[ RUN      ] NetworkFTest.Smoke
../networkf/networkf_test.cpp:35: Failure
Failed
Implemente me!
[  FAILED  ] NetworkFTest.Smoke (0 ms)
[----------] 1 test from NetworkFTest (0 ms total)

[----------] Global test environment tear-down
[==========] 1 test from 1 test suite ran. (0 ms total)
[  PASSED  ] 0 tests.
[  FAILED  ] 1 test, listed below:
[  FAILED  ] NetworkFTest.Smoke

 1 FAILED TEST