Failed

projectroot.sdk_test.ConfigTest.Config_CurrentDirectory (from CTest)

Failing for the past 46 builds (Since #3459 )
Took 0.12 sec.

Stacktrace

Note: Google Test filter = ConfigTest.Config_CurrentDirectory
[==========] Running 1 test from 1 test suite.
[----------] Global test environment set-up.
[----------] 1 test from ConfigTest
[ RUN      ] ConfigTest.Config_CurrentDirectory
../sdk_test/config_test.cpp:51: Failure
Expected equality of these values:
  helper.data_
    Which is: "/jenkins/tmp/fileKVq5mB/bbs/data"
  config.datadir()
    Which is: "/mnt/nfs/rpi4-1/jenkins/tmp/fileKVq5mB/bbs/data"
[  FAILED  ] ConfigTest.Config_CurrentDirectory (87 ms)
[----------] 1 test from ConfigTest (87 ms total)

[----------] Global test environment tear-down
[==========] 1 test from 1 test suite ran. (88 ms total)
[  PASSED  ] 0 tests.
[  FAILED  ] 1 test, listed below:
[  FAILED  ] ConfigTest.Config_CurrentDirectory

 1 FAILED TEST

Standard Output

Note: Google Test filter = ConfigTest.Config_CurrentDirectory
[==========] Running 1 test from 1 test suite.
[----------] Global test environment set-up.
[----------] 1 test from ConfigTest
[ RUN      ] ConfigTest.Config_CurrentDirectory
../sdk_test/config_test.cpp:51: Failure
Expected equality of these values:
  helper.data_
    Which is: "/jenkins/tmp/fileKVq5mB/bbs/data"
  config.datadir()
    Which is: "/mnt/nfs/rpi4-1/jenkins/tmp/fileKVq5mB/bbs/data"
[  FAILED  ] ConfigTest.Config_CurrentDirectory (87 ms)
[----------] 1 test from ConfigTest (87 ms total)

[----------] Global test environment tear-down
[==========] 1 test from 1 test suite ran. (88 ms total)
[  PASSED  ] 0 tests.
[  FAILED  ] 1 test, listed below:
[  FAILED  ] ConfigTest.Config_CurrentDirectory

 1 FAILED TEST