Failed

projectroot.net_core_test.NetDatTest.Rollover (from CTest)

Failing for the past 46 builds (Since #3459 )
Took 22 ms.

Stacktrace

Note: Google Test filter = NetDatTest.Rollover
[==========] Running 1 test from 1 test suite.
[----------] Global test environment set-up.
[----------] 1 test from NetDatTest
[ RUN      ] NetDatTest.Rollover
../net_core_test/netdat_test.cpp:86: Failure
Value of: File::Exists(FilePath(gfiles_, "netdat1.log"))
  Actual: false
Expected: true
[  FAILED  ] NetDatTest.Rollover (2 ms)
[----------] 1 test from NetDatTest (2 ms total)

[----------] Global test environment tear-down
[==========] 1 test from 1 test suite ran. (2 ms total)
[  PASSED  ] 0 tests.
[  FAILED  ] 1 test, listed below:
[  FAILED  ] NetDatTest.Rollover

 1 FAILED TEST

Standard Output

Note: Google Test filter = NetDatTest.Rollover
[==========] Running 1 test from 1 test suite.
[----------] Global test environment set-up.
[----------] 1 test from NetDatTest
[ RUN      ] NetDatTest.Rollover
../net_core_test/netdat_test.cpp:86: Failure
Value of: File::Exists(FilePath(gfiles_, "netdat1.log"))
  Actual: false
Expected: true
[  FAILED  ] NetDatTest.Rollover (2 ms)
[----------] 1 test from NetDatTest (2 ms total)

[----------] Global test environment tear-down
[==========] 1 test from 1 test suite ran. (2 ms total)
[  PASSED  ] 0 tests.
[  FAILED  ] 1 test, listed below:
[  FAILED  ] NetDatTest.Rollover

 1 FAILED TEST